{"text_format":"1","workbook":"xlsx","n_sheets":3,"sheets":["Ata","Simulador de pontos para progr.","Regras de cálculo"],"not_rendered":{"charts":0,"images":1,"macros":1,"external_links":0,"defined_names":2,"comments":0,"pivot_tables":0},"unopened":[],"bounds":{"document_bytes":16777216,"sheet_cells":100000,"rows_first":2000,"rows_last":500,"rows_between":2000,"halvings":0,"cell_chars":16384,"cell_head_chars":4096},"cells_cut":0,"cells_raw":0,"read":"whole","date_system":"1900"}

{"sheet":"Ata","index":0,"n_rows":113,"n_cols":6,"rows_kept":113,"cut":false,"hidden":false,"merged":[[106,0,106,2],[108,0,108,2],[110,0,110,2],[112,0,112,2],[1,2,1,3],[1,4,2,4],[3,1,3,2],[4,1,4,2],[5,1,5,2],[6,1,6,2],[7,1,7,2],[2,2,2,3],[26,1,26,2],[27,1,27,2],[28,1,28,2],[29,1,29,2],[30,1,30,2],[31,1,31,2],[20,1,20,2],[21,1,21,2],[22,1,22,2],[23,1,23,2],[24,1,24,2],[25,1,25,2],[0,0,0,4],[1,0,1,1],[2,0,2,1],[14,1,14,2],[15,1,15,2],[16,1,16,2],[17,1,17,2],[18,1,18,2],[19,1,19,2],[8,1,8,2],[9,1,9,2],[10,1,10,2],[11,1,11,2],[12,1,12,2],[13,1,13,2],[38,1,38,2],[39,1,39,2],[40,1,40,2],[41,1,41,2],[42,1,42,2],[43,1,43,2],[32,1,32,2],[33,1,33,2],[34,1,34,2],[35,1,35,2],[36,1,36,2],[37,1,37,2],[50,1,50,2],[51,1,51,2],[52,1,52,2],[53,1,53,2],[54,1,54,2],[55,1,55,2],[44,1,44,2],[45,1,45,2],[46,1,46,2],[47,1,47,2],[48,1,48,2],[49,1,49,2],[62,1,62,2],[63,1,63,2],[64,1,64,2],[65,1,65,2],[66,1,66,2],[67,1,67,2],[56,1,56,2],[57,1,57,2],[58,1,58,2],[59,1,59,2],[60,1,60,2],[61,1,61,2],[74,1,74,2],[75,1,75,2],[76,1,76,2],[77,1,77,2],[78,1,78,2],[79,1,79,2],[68,1,68,2],[69,1,69,2],[70,1,70,2],[71,1,71,2],[72,1,72,2],[73,1,73,2],[86,1,86,2],[87,1,87,2],[88,1,88,2],[89,1,89,2],[90,1,90,2],[91,1,91,2],[80,1,80,2],[81,1,81,2],[82,1,82,2],[83,1,83,2],[84,1,84,2],[85,1,85,2],[98,1,98,2],[99,1,99,2],[100,1,100,2],[101,1,101,2],[102,1,102,2],[92,1,92,2],[93,1,93,2],[94,1,94,2],[95,1,95,2],[96,1,96,2],[97,1,97,2]]}
["Ata de revisão de documentos - Processo Interno de Progressão Docente\nComissão de Progressões e Promoções - Ensino Superior"]
["Código / Nome do candidato:",null,{"$f":"'Simulador de pontos para progr.'!J4&\" / \"&'Simulador de pontos para progr.'!K4","v":" / "},null,{"$f":"IF('Simulador de pontos para progr.'!E162>=VLOOKUP(C3,'Regras de cálculo'!C:D,2,0),\"ATINGIU PONTUAÇÃO\",\"NÃO ATINGIU PONTUAÇÃO\")&\" (\"&'Simulador de pontos para progr.'!E162&\"/\"&VLOOKUP(C3,'Regras de cálculo'!C:D,2,0)&\")\"","v":{"$error":"#N/A"}}]
["Cargo pretendido:",null,{"$f":"'Simulador de pontos para progr.'!L4","v":0}]
["Item","Descrição",null,"Deferimento","Justificativa","FILTRO"]
[{"$f":"'Simulador de pontos para progr.'!A6","v":"D1.1.1"},{"$f":"VLOOKUP(A:A,'Simulador de pontos para progr.'!A:B,2,0)","v":"Para 40h de participação como ouvinte em cursos ou eventos academicos e cientificos(regional)"},null,{"$f":"IF(VLOOKUP(A:A,'Simulador de pontos para progr.'!A:J,10,0)=0,\"\",VLOOKUP(A:A,'Simulador de pontos para progr.'!A:J,10,0))","v":""},{"$f":"IF(D:D=\"Parcialmente Deferido\",\"Pontuação aproveitada (sem considerar regra de redimensionamento): \"&VLOOKUP(A:A,'Simulador de pontos para progr.'!A:H,6,0)&\" pontos. \"&IF(VLOOKUP(A:A,'Simulador de pontos para progr.'!A:K,11,0)=0,\"\",VLOOKUP(A:A,'Simulador de pontos para progr.'!A:K,11,0)),IF(VLOOKUP(A:A,'Simulador de pontos para progr.'!A:K,11,0)=0,\"\",VLOOKUP(A:A,'Simulador de pontos para progr.'!A:K,11,0)))","v":""},{"$f":"IF(OR(D:D=\"Indeferido\",D:D=\"Parcialmente Deferido\",A:A=\"Não houve itens indeferidos ou parcialmente indeferidos.\"),\"Mostra\",\"Esconde\")","v":"Esconde"}]
[{"$f":"'Simulador de pontos para progr.'!A7","v":"D1.1.2"},{"$f":"VLOOKUP(A:A,'Simulador de pontos para progr.'!A:B,2,0)","v":"Para 40h de participação como ouvinte em cursos ou eventos academicos e cientificos(nacional)"},null,{"$f":"IF(VLOOKUP(A:A,'Simulador de pontos para progr.'!A:J,10,0)=0,\"\",VLOOKUP(A:A,'Simulador de pontos para progr.'!A:J,10,0))","v":""},{"$f":"IF(D:D=\"Parcialmente Deferido\",\"Pontuação aproveitada (sem considerar regra de redimensionamento): \"&VLOOKUP(A:A,'Simulador de pontos para progr.'!A:H,6,0)&\" pontos. \"&IF(VLOOKUP(A:A,'Simulador de pontos para progr.'!A:K,11,0)=0,\"\",VLOOKUP(A:A,'Simulador de pontos para progr.'!A:K,11,0)),IF(VLOOKUP(A:A,'Simulador de pontos para progr.'!A:K,11,0)=0,\"\",VLOOKUP(A:A,'Simulador de pontos para progr.'!A:K,11,0)))","v":""},"Esconde"]
[{"$f":"'Simulador de pontos para progr.'!A8","v":"D1.1.3"},{"$f":"VLOOKUP(A:A,'Simulador de pontos para progr.'!A:B,2,0)","v":"Para 40h de participação como ouvinte em cursos ou eventos academicos ecientificos(internacional)"},null,{"$f":"IF(VLOOKUP(A:A,'Simulador de pontos para progr.'!A:J,10,0)=0,\"\",VLOOKUP(A:A,'Simulador de pontos para progr.'!A:J,10,0))","v":""},{"$f":"IF(D:D=\"Parcialmente Deferido\",\"Pontuação aproveitada (sem considerar regra de redimensionamento): \"&VLOOKUP(A:A,'Simulador de pontos para progr.'!A:H,6,0)&\" pontos. \"&IF(VLOOKUP(A:A,'Simulador de pontos para progr.'!A:K,11,0)=0,\"\",VLOOKUP(A:A,'Simulador de pontos para progr.'!A:K,11,0)),IF(VLOOKUP(A:A,'Simulador de pontos para progr.'!A:K,11,0)=0,\"\",VLOOKUP(A:A,'Simulador de pontos para progr.'!A:K,11,0)))","v":""},"Esconde"]
[{"$f":"'Simulador de pontos para progr.'!A11","v":"D1.2.1"},{"$f":"VLOOKUP(A:A,'Simulador de pontos para progr.'!A:B,2,0)","v":"Apresentação de trabalhos sem publicação (regional)"},null,{"$f":"IF(VLOOKUP(A:A,'Simulador de pontos para progr.'!A:J,10,0)=0,\"\",VLOOKUP(A:A,'Simulador de pontos para progr.'!A:J,10,0))","v":""},{"$f":"IF(D:D=\"Parcialmente Deferido\",\"Pontuação aproveitada (sem considerar regra de redimensionamento): \"&VLOOKUP(A:A,'Simulador de pontos para progr.'!A:H,6,0)&\" pontos. \"&IF(VLOOKUP(A:A,'Simulador de pontos para progr.'!A:K,11,0)=0,\"\",VLOOKUP(A:A,'Simulador de pontos para progr.'!A:K,11,0)),IF(VLOOKUP(A:A,'Simulador de pontos para progr.'!A:K,11,0)=0,\"\",VLOOKUP(A:A,'Simulador de pontos para progr.'!A:K,11,0)))","v":""},"Esconde"]
[{"$f":"'Simulador de pontos para progr.'!A12","v":"D1.2.2"},{"$f":"VLOOKUP(A:A,'Simulador de pontos para progr.'!A:B,2,0)","v":"Apresentação de trabalhos sem publicação (nacional)"},null,{"$f":"IF(VLOOKUP(A:A,'Simulador de pontos para progr.'!A:J,10,0)=0,\"\",VLOOKUP(A:A,'Simulador de pontos para progr.'!A:J,10,0))","v":""},{"$f":"IF(D:D=\"Parcialmente Deferido\",\"Pontuação aproveitada (sem considerar regra de redimensionamento): \"&VLOOKUP(A:A,'Simulador de pontos para progr.'!A:H,6,0)&\" pontos. \"&IF(VLOOKUP(A:A,'Simulador de pontos para progr.'!A:K,11,0)=0,\"\",VLOOKUP(A:A,'Simulador de pontos para progr.'!A:K,11,0)),IF(VLOOKUP(A:A,'Simulador de pontos para progr.'!A:K,11,0)=0,\"\",VLOOKUP(A:A,'Simulador de pontos para progr.'!A:K,11,0)))","v":""},"Esconde"]
[{"$f":"'Simulador de pontos para progr.'!A13","v":"D1.2.3"},{"$f":"VLOOKUP(A:A,'Simulador de pontos para progr.'!A:B,2,0)","v":"Apresentação de trabalhos sem publicação (internacional)"},null,{"$f":"IF(VLOOKUP(A:A,'Simulador de pontos para progr.'!A:J,10,0)=0,\"\",VLOOKUP(A:A,'Simulador de pontos para progr.'!A:J,10,0))","v":""},{"$f":"IF(D:D=\"Parcialmente Deferido\",\"Pontuação aproveitada (sem considerar regra de redimensionamento): \"&VLOOKUP(A:A,'Simulador de pontos para progr.'!A:H,6,0)&\" pontos. \"&IF(VLOOKUP(A:A,'Simulador de pontos para progr.'!A:K,11,0)=0,\"\",VLOOKUP(A:A,'Simulador de pontos para progr.'!A:K,11,0)),IF(VLOOKUP(A:A,'Simulador de pontos para progr.'!A:K,11,0)=0,\"\",VLOOKUP(A:A,'Simulador de pontos para progr.'!A:K,11,0)))","v":""},"Esconde"]
[{"$f":"'Simulador de pontos para progr.'!A16","v":"D1.3.1"},{"$f":"VLOOKUP(A:A,'Simulador de pontos para progr.'!A:B,2,0)","v":"Organização e coordenação de eventos (regional)"},null,{"$f":"IF(VLOOKUP(A:A,'Simulador de pontos para progr.'!A:J,10,0)=0,\"\",VLOOKUP(A:A,'Simulador de pontos para progr.'!A:J,10,0))","v":""},{"$f":"IF(D:D=\"Parcialmente Deferido\",\"Pontuação aproveitada (sem considerar regra de redimensionamento): \"&VLOOKUP(A:A,'Simulador de pontos para progr.'!A:H,6,0)&\" pontos. \"&IF(VLOOKUP(A:A,'Simulador de pontos para progr.'!A:K,11,0)=0,\"\",VLOOKUP(A:A,'Simulador de pontos para progr.'!A:K,11,0)),IF(VLOOKUP(A:A,'Simulador de pontos para progr.'!A:K,11,0)=0,\"\",VLOOKUP(A:A,'Simulador de pontos para progr.'!A:K,11,0)))","v":""},"Esconde"]
[{"$f":"'Simulador de pontos para progr.'!A17","v":"D1.3.2"},{"$f":"VLOOKUP(A:A,'Simulador de pontos para progr.'!A:B,2,0)","v":"Organização e coordenação de eventos (nacional)"},null,{"$f":"IF(VLOOKUP(A:A,'Simulador de pontos para progr.'!A:J,10,0)=0,\"\",VLOOKUP(A:A,'Simulador de pontos para progr.'!A:J,10,0))","v":""},{"$f":"IF(D:D=\"Parcialmente Deferido\",\"Pontuação aproveitada (sem considerar regra de redimensionamento): \"&VLOOKUP(A:A,'Simulador de pontos para progr.'!A:H,6,0)&\" pontos. \"&IF(VLOOKUP(A:A,'Simulador de pontos para progr.'!A:K,11,0)=0,\"\",VLOOKUP(A:A,'Simulador de pontos para progr.'!A:K,11,0)),IF(VLOOKUP(A:A,'Simulador de pontos para progr.'!A:K,11,0)=0,\"\",VLOOKUP(A:A,'Simulador de pontos para progr.'!A:K,11,0)))","v":""},"Esconde"]
[{"$f":"'Simulador de pontos para progr.'!A18","v":"D1.3.3"},{"$f":"VLOOKUP(A:A,'Simulador de pontos para progr.'!A:B,2,0)","v":"Organização e coordenação de eventos (internacional)"},null,{"$f":"IF(VLOOKUP(A:A,'Simulador de pontos para progr.'!A:J,10,0)=0,\"\",VLOOKUP(A:A,'Simulador de pontos para progr.'!A:J,10,0))","v":""},{"$f":"IF(D:D=\"Parcialmente Deferido\",\"Pontuação aproveitada (sem considerar regra de redimensionamento): \"&VLOOKUP(A:A,'Simulador de pontos para progr.'!A:H,6,0)&\" pontos. \"&IF(VLOOKUP(A:A,'Simulador de pontos para progr.'!A:K,11,0)=0,\"\",VLOOKUP(A:A,'Simulador de pontos para progr.'!A:K,11,0)),IF(VLOOKUP(A:A,'Simulador de pontos para progr.'!A:K,11,0)=0,\"\",VLOOKUP(A:A,'Simulador de pontos para progr.'!A:K,11,0)))","v":""},"Esconde"]
[{"$f":"'Simulador de pontos para progr.'!A21","v":"D1.4.1"},{"$f":"VLOOKUP(A:A,'Simulador de pontos para progr.'!A:B,2,0)","v":"Participação como palestrante em eventos ou ministrante de curso (regional)"},null,{"$f":"IF(VLOOKUP(A:A,'Simulador de pontos para progr.'!A:J,10,0)=0,\"\",VLOOKUP(A:A,'Simulador de pontos para progr.'!A:J,10,0))","v":""},{"$f":"IF(D:D=\"Parcialmente Deferido\",\"Pontuação aproveitada (sem considerar regra de redimensionamento): \"&VLOOKUP(A:A,'Simulador de pontos para progr.'!A:H,6,0)&\" pontos. \"&IF(VLOOKUP(A:A,'Simulador de pontos para progr.'!A:K,11,0)=0,\"\",VLOOKUP(A:A,'Simulador de pontos para progr.'!A:K,11,0)),IF(VLOOKUP(A:A,'Simulador de pontos para progr.'!A:K,11,0)=0,\"\",VLOOKUP(A:A,'Simulador de pontos para progr.'!A:K,11,0)))","v":""},"Esconde"]
[{"$f":"'Simulador de pontos para progr.'!A22","v":"D1.4.2"},{"$f":"VLOOKUP(A:A,'Simulador de pontos para progr.'!A:B,2,0)","v":"Participação como palestrante em eventos ou ministrante de curso (nacional)"},null,{"$f":"IF(VLOOKUP(A:A,'Simulador de pontos para progr.'!A:J,10,0)=0,\"\",VLOOKUP(A:A,'Simulador de pontos para progr.'!A:J,10,0))","v":""},{"$f":"IF(D:D=\"Parcialmente Deferido\",\"Pontuação aproveitada (sem considerar regra de redimensionamento): \"&VLOOKUP(A:A,'Simulador de pontos para progr.'!A:H,6,0)&\" pontos. \"&IF(VLOOKUP(A:A,'Simulador de pontos para progr.'!A:K,11,0)=0,\"\",VLOOKUP(A:A,'Simulador de pontos para progr.'!A:K,11,0)),IF(VLOOKUP(A:A,'Simulador de pontos para progr.'!A:K,11,0)=0,\"\",VLOOKUP(A:A,'Simulador de pontos para progr.'!A:K,11,0)))","v":""},"Esconde"]
[{"$f":"'Simulador de pontos para progr.'!A23","v":"D1.4.3"},{"$f":"VLOOKUP(A:A,'Simulador de pontos para progr.'!A:B,2,0)","v":"Participação como palestrante em eventos ou ministrante de curso (internacional)"},null,{"$f":"IF(VLOOKUP(A:A,'Simulador de pontos para progr.'!A:J,10,0)=0,\"\",VLOOKUP(A:A,'Simulador de pontos para progr.'!A:J,10,0))","v":""},{"$f":"IF(D:D=\"Parcialmente Deferido\",\"Pontuação aproveitada (sem considerar regra de redimensionamento): \"&VLOOKUP(A:A,'Simulador de pontos para progr.'!A:H,6,0)&\" pontos. \"&IF(VLOOKUP(A:A,'Simulador de pontos para progr.'!A:K,11,0)=0,\"\",VLOOKUP(A:A,'Simulador de pontos para progr.'!A:K,11,0)),IF(VLOOKUP(A:A,'Simulador de pontos para progr.'!A:K,11,0)=0,\"\",VLOOKUP(A:A,'Simulador de pontos para progr.'!A:K,11,0)))","v":""},"Esconde"]
[{"$f":"'Simulador de pontos para progr.'!A26","v":"D1.5.1"},{"$f":"VLOOKUP(A:A,'Simulador de pontos para progr.'!A:B,2,0)","v":"Mediação em mesas de eventos (regional)"},null,{"$f":"IF(VLOOKUP(A:A,'Simulador de pontos para progr.'!A:J,10,0)=0,\"\",VLOOKUP(A:A,'Simulador de pontos para progr.'!A:J,10,0))","v":""},{"$f":"IF(D:D=\"Parcialmente Deferido\",\"Pontuação aproveitada (sem considerar regra de redimensionamento): \"&VLOOKUP(A:A,'Simulador de pontos para progr.'!A:H,6,0)&\" pontos. \"&IF(VLOOKUP(A:A,'Simulador de pontos para progr.'!A:K,11,0)=0,\"\",VLOOKUP(A:A,'Simulador de pontos para progr.'!A:K,11,0)),IF(VLOOKUP(A:A,'Simulador de pontos para progr.'!A:K,11,0)=0,\"\",VLOOKUP(A:A,'Simulador de pontos para progr.'!A:K,11,0)))","v":""},"Esconde"]
[{"$f":"'Simulador de pontos para progr.'!A27","v":"D1.5.2"},{"$f":"VLOOKUP(A:A,'Simulador de pontos para progr.'!A:B,2,0)","v":"Mediação em mesas de eventos (nacional)"},null,{"$f":"IF(VLOOKUP(A:A,'Simulador de pontos para progr.'!A:J,10,0)=0,\"\",VLOOKUP(A:A,'Simulador de pontos para progr.'!A:J,10,0))","v":""},{"$f":"IF(D:D=\"Parcialmente Deferido\",\"Pontuação aproveitada (sem considerar regra de redimensionamento): \"&VLOOKUP(A:A,'Simulador de pontos para progr.'!A:H,6,0)&\" pontos. \"&IF(VLOOKUP(A:A,'Simulador de pontos para progr.'!A:K,11,0)=0,\"\",VLOOKUP(A:A,'Simulador de pontos para progr.'!A:K,11,0)),IF(VLOOKUP(A:A,'Simulador de pontos para progr.'!A:K,11,0)=0,\"\",VLOOKUP(A:A,'Simulador de pontos para progr.'!A:K,11,0)))","v":""},"Esconde"]
[{"$f":"'Simulador de pontos para progr.'!A28","v":"D1.5.3"},{"$f":"VLOOKUP(A:A,'Simulador de pontos para progr.'!A:B,2,0)","v":"Mediação em mesas de eventos (internacional)"},null,{"$f":"IF(VLOOKUP(A:A,'Simulador de pontos para progr.'!A:J,10,0)=0,\"\",VLOOKUP(A:A,'Simulador de pontos para progr.'!A:J,10,0))","v":""},{"$f":"IF(D:D=\"Parcialmente Deferido\",\"Pontuação aproveitada (sem considerar regra de redimensionamento): \"&VLOOKUP(A:A,'Simulador de pontos para progr.'!A:H,6,0)&\" pontos. \"&IF(VLOOKUP(A:A,'Simulador de pontos para progr.'!A:K,11,0)=0,\"\",VLOOKUP(A:A,'Simulador de pontos para progr.'!A:K,11,0)),IF(VLOOKUP(A:A,'Simulador de pontos para progr.'!A:K,11,0)=0,\"\",VLOOKUP(A:A,'Simulador de pontos para progr.'!A:K,11,0)))","v":""},"Esconde"]
[{"$f":"'Simulador de pontos para progr.'!A34","v":"D2.1.1"},{"$f":"VLOOKUP(A:A,'Simulador de pontos para progr.'!A:B,2,0)","v":"Marca (logomarca) registrada"},null,{"$f":"IF(VLOOKUP(A:A,'Simulador de pontos para progr.'!A:J,10,0)=0,\"\",VLOOKUP(A:A,'Simulador de pontos para progr.'!A:J,10,0))","v":""},{"$f":"IF(D:D=\"Parcialmente Deferido\",\"Pontuação aproveitada (sem considerar regra de redimensionamento): \"&VLOOKUP(A:A,'Simulador de pontos para progr.'!A:H,6,0)&\" pontos. \"&IF(VLOOKUP(A:A,'Simulador de pontos para progr.'!A:K,11,0)=0,\"\",VLOOKUP(A:A,'Simulador de pontos para progr.'!A:K,11,0)),IF(VLOOKUP(A:A,'Simulador de pontos para progr.'!A:K,11,0)=0,\"\",VLOOKUP(A:A,'Simulador de pontos para progr.'!A:K,11,0)))","v":""},"Esconde"]
{"$rows_left_out":94}
{"sheet":"Simulador de pontos para progr.","index":1,"n_rows":162,"n_cols":12,"rows_kept":162,"cut":false,"hidden":false,"merged":[[147,10,147,11],[148,10,148,11],[137,10,137,11],[138,10,138,11],[139,10,139,11],[144,10,144,11],[145,10,145,11],[132,10,132,11],[133,10,133,11],[134,10,134,11],[135,10,135,11],[136,10,136,11],[129,10,129,11],[130,10,130,11],[131,10,131,11],[113,10,113,11],[119,10,119,11],[120,10,120,11],[121,10,121,11],[122,10,122,11],[146,10,146,11],[111,10,111,11],[112,10,112,11],[101,10,101,11],[102,10,102,11],[103,10,103,11],[106,10,106,11],[107,10,107,11],[123,10,123,11],[128,10,128,11],[84,10,84,11],[73,10,73,11],[74,10,74,11],[75,10,75,11],[76,10,76,11],[77,10,77,11],[108,10,108,11],[109,10,109,11],[110,10,110,11],[72,10,72,11],[118,10,118,11],[127,10,127,11],[143,10,143,11],[41,10,41,11],[42,10,42,11],[43,10,43,11],[44,10,44,11],[45,10,45,11],[46,10,46,11],[47,10,47,11],[48,10,48,11],[49,10,49,11],[50,10,50,11],[51,10,51,11],[54,10,54,11],[57,10,57,11],[67,10,67,11],[83,10,83,11],[91,10,91,11],[78,10,78,11],[79,10,79,11],[80,10,80,11],[81,10,81,11],[118,0,118,8],[124,0,124,3],[127,0,127,8],[61,10,61,11],[62,10,62,11],[63,10,63,11],[64,10,64,11],[19,10,19,11],[24,10,24,11],[32,10,32,11],[40,10,40,11],[53,10,53,11],[28,10,28,11],[39,10,39,11],[52,10,52,11],[55,10,55,11],[33,10,33,11],[34,10,34,11],[35,10,35,11],[36,10,36,11],[37,10,37,11],[38,10,38,11],[58,10,58,11],[59,10,59,11],[82,0,82,3],[89,0,89,7],[32,0,32,8],[87,0,87,3],[97,0,97,3],[88,0,88,3],[104,0,104,3],[114,0,114,3],[98,0,98,8],[53,0,53,8],[161,1,161,3],[153,1,153,4],[141,0,141,7],[150,0,150,4],[116,0,116,7],[125,0,125,7],[143,0,143,8],[149,0,149,3],[1,0,1,8],[140,0,140,3],[115,0,115,3],[105,0,105,8],[83,0,83,8],[91,0,91,8],[29,0,29,3],[30,0,30,7],[4,0,4,8],[8,0,8,3],[9,0,9,8],[13,0,13,3],[14,0,14,8],[39,0,39,3],[52,0,52,3],[55,0,55,3],[0,0,0,8],[18,0,18,3],[56,0,56,8],[67,0,67,8],[2,0,2,7],[24,0,24,8],[23,0,23,3],[28,0,28,3],[19,0,19,8],[40,0,40,8],[66,0,66,3],[4,10,4,11],[5,10,5,11],[6,10,6,11],[7,10,7,11],[10,10,10,11],[9,10,9,11],[27,10,27,11],[8,10,8,11],[13,10,13,11],[18,10,18,11],[23,10,23,11],[20,10,20,11],[21,10,21,11],[22,10,22,11],[25,10,25,11],[26,10,26,11],[11,10,11,11],[12,10,12,11],[15,10,15,11],[16,10,16,11],[17,10,17,11],[14,10,14,11],[66,10,66,11],[56,10,56,11],[65,10,65,11],[82,10,82,11],[87,10,87,11],[97,10,97,11],[104,10,104,11],[114,10,114,11],[98,10,98,11],[105,10,105,11],[85,10,85,11],[86,10,86,11],[92,10,92,11],[93,10,93,11],[94,10,94,11],[95,10,95,11],[96,10,96,11],[99,10,99,11],[100,10,100,11],[60,10,60,11],[68,10,68,11],[69,10,69,11],[70,10,70,11],[71,10,71,11]]}
["Anexo 01 - Edital Interno de Progressão - Quadro de Carreira Docente do Ensino Superior"]
[]
["DIMENSÃO 1: Participação em cursos e eventos apresentando trabalhos, atuando como palestrante, mediador, organizador, coordenador e ouvinte.",null,null,null,null,null,null,null,null,"MATRÍCULA","NOME DO CANDIDATO","CARGO PRETENDIDO"]
["Legenda","Critério de Avaliação","Fornecimento quando evento da Feevale","Pontos","Quantidade preenchida pelo docente","Total de Pontos","Quantidade de documentos entregues","%","Setor para solicitar 2ª via Prazo: 10 dias úteis"]
["1.1 Participação como ouvinte em cursos ou eventos acadêmicos e científicos",null,null,null,null,null,null,null,null,"Deferido?","Justificativa da ata"]
["D1.1.1","Para 40h de participação como ouvinte em cursos ou eventos academicos e cientificos(regional)","Núcleo de Cursos e Eventos de Extensão",1,null,{"$f":"D6*E6","v":0},null,null,"Atendimento Feevale  "]
["D1.1.2","Para 40h de participação como ouvinte em cursos ou eventos academicos e cientificos(nacional)","Núcleo de Cursos e Eventos de Extensão",2,null,{"$f":"D7*E7","v":0},null,null,"Atendimento Feevale  "]
["D1.1.3","Para 40h de participação como ouvinte em cursos ou eventos academicos ecientificos(internacional)","Núcleo de Cursos e Eventos de Extensão",3,null,{"$f":"D8*E8","v":0},null,null,"Atendimento Feevale  "]
["Total ",null,null,null,null,{"$f":"SUM(F6:F8)","v":0},{"$f":"SUM(G6:G8)","v":0}]
["1.2 Apresentação de trabalhos sem publicação",null,null,null,null,null,null,null,null,"Deferido?","Justificativa da ata"]
["D1.2.1","Apresentação de trabalhos sem publicação (regional)","Núcleo de Cursos e Eventos de Extensão",2.67,null,{"$f":"D11*E11","v":0},null,null,"Atendimento Feevale  "]
["D1.2.2","Apresentação de trabalhos sem publicação (nacional)","Núcleo de Cursos e Eventos de Extensão",5,null,{"$f":"D12*E12","v":0},null,null,"Atendimento Feevale  "]
["D1.2.3","Apresentação de trabalhos sem publicação (internacional)","Núcleo de Cursos e Eventos de Extensão",9.33,null,{"$f":"D13*E13","v":0},null,null,"Atendimento Feevale  "]
["Total",null,null,null,null,{"$f":"SUM(F11:F13)","v":0},{"$f":"SUM(G11:G13)","v":0}]
["1.3 Organização e coordenação de eventos",null,null,null,null,null,null,null,null,"Deferido?","Justificativa da ata"]
["D1.3.1","Organização e coordenação de eventos (regional)","Núcleo de Cursos e Eventos de Extensão",3.33,null,{"$f":"D16*E16","v":0},null,null,"Atendimento Feevale  "]
["D1.3.2","Organização e coordenação de eventos (nacional)","Núcleo de Cursos e Eventos de Extensão",6,null,{"$f":"D17*E17","v":0},null,null,"Atendimento Feevale  "]
["D1.3.3","Organização e coordenação de eventos (internacional)","Núcleo de Cursos e Eventos de Extensão",9.33,null,{"$f":"D18*E18","v":0},null,null,"Atendimento Feevale  "]
["Total",null,null,null,null,{"$f":"SUM(F16:F18)","v":0},{"$f":"SUM(G16:G18)","v":0}]
["1.4 Participação como palestrante em eventos ou ministrante de curso",null,null,null,null,null,null,null,null,"Deferido?","Justificativa da ata"]
{"$rows_left_out":143}
{"sheet":"Regras de cálculo","index":2,"n_rows":12,"n_cols":7,"rows_kept":12,"cut":false,"hidden":false,"merged":[]}
["Deferido?",null,"Cargo","Pontuação",null,1,"Janeiro"]
["Deferido",null,"Assistente 1A",200,null,2,"Fevereiro"]
["Parcialmente Deferido",null,"Assistente 2A",250,null,3,"Março"]
["Indeferido",null,"Adjunto 1A",350,null,4,"Abril"]
[null,null,"Adjunto 2A",400,null,5,"Maio"]
[null,null,"Titular 1A",500,null,6,"Junho"]
[null,null,"Titular 2A",600,null,7,"Julho"]
[null,null,null,null,null,8,"Agosto"]
[null,null,null,null,null,9,"Setembro"]
[null,null,null,null,null,10,"Outubro"]
[null,null,null,null,null,11,"Novembro"]
[null,null,null,null,null,12,"Dezembro"]